cackle-v
type: LexicalEntry
canonical form: cackle
sense: 00031411-v
part of speech: verb

00031411-v
type: LexicalConcept
in scheme: en-word.net
definition: emit a loud, unpleasant kind of laughing
ili: i21922
lexfile: verb.body
part of speech: verb
hypernym: 00031813-v