grin-v
type: LexicalEntry
canonical form: grin
sense: 00029018-v
part of speech: verb

00029018-v
type: LexicalConcept
in scheme: en-word.net
definition: to draw back the lips and reveal the teeth, in a smile, grimace, or snarl
ili: i21906
lexfile: verb.body
part of speech: verb
hypernym: 00028558-v