smile-v
type: LexicalEntry
canonical form: smile
sense: 00028558-v
part of speech: verb

00028558-v
type: LexicalConcept
in scheme: en-word.net
definition: change one's facial expression by spreading the lips, often to signal pleasure
ili: i21904
lexfile: verb.body
part of speech: verb
hypernym: 00034281-v