attribute-n
type: LexicalEntry
canonical form: attribute
sense: 00024444-n
part of speech: noun

00024444-n
type: LexicalConcept
in scheme: en-word.net
definition: an abstraction belonging to or characteristic of an entity
ili: i35577
lexfile: noun.Tops
part of speech: noun
hypernym: 00002137-n