nod-v
type: LexicalEntry
canonical form: nod
sense: 00016695-v
part of speech: verb

00016695-v
type: LexicalConcept
in scheme: en-word.net
definition: let the head fall forward through drowsiness
example: The old man was nodding in his chair
ili: i21850
lexfile: verb.body
part of speech: verb
hypernym: 01835473-v