copious-a
type: LexicalEntry
canonical form: copious
sense: 00014877-s
part of speech: adjective

voluminous-a
type: LexicalEntry
canonical form: voluminous
sense: 00014877-s
part of speech: adjective

00014877-s
type: LexicalConcept
in scheme: en-word.net
definition: large in number or quantity (especially of discourse)
example: she took copious notes
example: a subject of voluminous legislation
ili: i65
lexfile: adj.all
part of speech: adjective satellite
similar: https://en-word.net/synset/00013906-a