twitch-v
type: LexicalEntry
canonical form: twitch
sense: 00009624-v
part of speech: verb

jerk-v
type: LexicalEntry
canonical form: jerk
sense: 00009624-v
part of speech: verb

00009624-v
type: LexicalConcept
in scheme: en-word.net
definition: make an uncontrolled, short, jerky motion
example: his face is twitching
ili: i21815
lexfile: verb.body
part of speech: verb
hypernym: 00010047-v
similar: 01895810-v