squint-v
type: LexicalEntry
canonical form: squint
sense: 00008792-v
part of speech: verb

00008792-v
type: LexicalConcept
in scheme: en-word.net
definition: partly close one's eyes, as when hit by direct blinding light
example: The driver squinted as the sun hit his windshield
ili: i21811
lexfile: verb.body
part of speech: verb
hypernym: 00033592-v
hypernym: 02169748-v