whole-n
type: LexicalEntry
canonical form: whole
sense: 00003553-n
part of speech: noun

unit-n
type: LexicalEntry
canonical form: unit
sense: 00003553-n
part of speech: noun

00003553-n
type: LexicalConcept
in scheme: en-word.net
definition: an assemblage of parts that is regarded as a single entity
example: how big is that part compared to the whole?
example: the team is a unit
ili: i35550
lexfile: noun.Tops
part of speech: noun
hypernym: 00002684-n
mero part: 03898588-n
mero part: 04172050-n