abstraction-n
type: LexicalEntry
canonical form: abstraction
sense: 00002137-n
part of speech: noun

abstract entity-n
type: LexicalEntry
canonical form: abstract entity
sense: 00002137-n
part of speech: noun

00002137-n
type: LexicalConcept
in scheme: en-word.net
definition: a general concept formed by extracting common features from specific examples
ili: i35547
lexfile: noun.Tops
part of speech: noun
hypernym: 00001740-n