womanhood-n
type: LexicalEntry
canonical form: womanhood
sense: 08494645-n
part of speech: noun

woman-n
type: LexicalEntry
canonical form: woman
sense: 08494645-n
part of speech: noun
sense: 10807146-n
sense: 10808492-n
sense: 84187159-n

fair sex-n
type: LexicalEntry
canonical form: fair sex
sense: 08494645-n
part of speech: noun

08494645-n
type: LexicalConcept
in scheme: en-word.net
definition: women as a class
example: it's an insult to American womanhood
example: woman is the glory of creation
example: the fair sex gathered on the veranda
ili: i81598
lexfile: noun.group
part of speech: noun
hypernym: 07990472-n

adult female-n
type: LexicalEntry
canonical form: adult female
sense: 10807146-n
part of speech: noun

10807146-n
type: LexicalConcept
in scheme: en-word.net
definition: an adult female person (as opposed to a man)
example: the woman kept house while the man hunted
ili: i94168
lexfile: noun.person
part of speech: noun
exemplifies: 06730109-n
hypernym: 09642198-n
hypernym: 09628463-n
mero part: 05227400-n

10808492-n
type: LexicalConcept
in scheme: en-word.net
definition: a female person who plays a significant role (wife or mistress or girlfriend) in the life of a particular man
example: he was faithful to his woman
ili: i94169
lexfile: noun.person
part of speech: noun
exemplifies: 07089193-n
hypernym: 09642198-n

servicewoman-n
type: LexicalEntry
canonical form: servicewoman
sense: 84187159-n
part of speech: noun

military woman-n
type: LexicalEntry
canonical form: military woman
sense: 84187159-n
part of speech: noun

84187159-n
type: LexicalConcept
in scheme: en-word.net
definition: a woman who serves in the armed forces; a member of a military force
lexfile: noun.person
part of speech: noun
hypernym: 10602198-n
hypernym: 10807146-n