withdrawal-n
type: LexicalEntry
canonical form: withdrawal
sense: 00054733-n
part of speech: noun
sense: 00229778-n
sense: 00385741-n
sense: 00850689-n
sense: 01205289-n
sense: 01265206-n
sense: 01265361-n
sense: 07220962-n
sense: 07521270-n

00054733-n
type: LexicalConcept
in scheme: en-word.net
definition: the act of withdrawing
example: the withdrawal of French troops from Vietnam
ili: i35689
lexfile: noun.act
part of speech: noun
hypernym: 00043495-n

drug withdrawal-n
type: LexicalEntry
canonical form: drug withdrawal
sense: 00229778-n
part of speech: noun

00229778-n
type: LexicalConcept
in scheme: en-word.net
definition: the termination of drug taking
ili: i36612
lexfile: noun.act
part of speech: noun
hypernym: 00210792-n

secession-n
type: LexicalEntry
canonical form: secession
sense: 00385741-n
part of speech: noun

00385741-n
type: LexicalConcept
in scheme: en-word.net
definition: formal separation from an alliance or federation
ili: i37426
lexfile: noun.act
part of speech: noun
hypernym: 00384414-n

coitus interruptus-n
type: LexicalEntry
canonical form: coitus interruptus
sense: 00850689-n
part of speech: noun

withdrawal method-n
type: LexicalEntry
canonical form: withdrawal method
sense: 00850689-n
part of speech: noun

pulling out-n
type: LexicalEntry
canonical form: pulling out
sense: 00850689-n
part of speech: noun

onanism-n
type: LexicalEntry
canonical form: onanism
sense: 00850689-n
part of speech: noun

00850689-n
type: LexicalConcept
in scheme: en-word.net
definition: a method of birth control in which coitus is initiated but the penis is deliberately withdrawn before ejaculation
ili: i39862
lexfile: noun.act
part of speech: noun
hypernym: 00853624-n

01205289-n
type: LexicalConcept
in scheme: en-word.net
definition: the act of ceasing to participate in an activity
ili: i41687
lexfile: noun.act
part of speech: noun
hypernym: 00384414-n

01265206-n
type: LexicalConcept
in scheme: en-word.net
definition: the act of taking out money or other capital
ili: i42024
lexfile: noun.act
part of speech: noun
hypernym: 00392407-n

01265361-n
type: LexicalConcept
in scheme: en-word.net
definition: the act of withdrawing blood, tumors, etc.
example: the nurse was expert at the withdrawal of blood
ili: i42025
lexfile: noun.act
part of speech: noun
hypernym: 00392407-n

backdown-n
type: LexicalEntry
canonical form: backdown
sense: 07220962-n
part of speech: noun

climb-down-n
type: LexicalEntry
canonical form: climb-down
sense: 07220962-n
part of speech: noun

07220962-n
type: LexicalConcept
in scheme: en-word.net
definition: a retraction of a previously held position
ili: i74527
lexfile: noun.communication
part of speech: noun
hypernym: 07220756-n

detachment-n
type: LexicalEntry
canonical form: detachment
sense: 07521270-n
part of speech: noun

07521270-n
type: LexicalConcept
in scheme: en-word.net
definition: avoiding emotional involvement
ili: i76193
lexfile: noun.feeling
part of speech: noun
hypernym: 07520915-n