winter-v
type: LexicalEntry
canonical form: winter
sense: 02715447-v
part of speech: verb

overwinter-v
type: LexicalEntry
canonical form: overwinter
sense: 02715447-v
part of speech: verb

02715447-v
type: LexicalConcept
in scheme: en-word.net
definition: spend the winter
example: We wintered on the Riviera
example: Shackleton's men overwintered on Elephant Island
ili: i35209
lexfile: verb.stative
part of speech: verb
hypernym: 02714280-v

winter-n
type: LexicalEntry
canonical form: winter
sense: 15262579-n
part of speech: noun

wintertime-n
type: LexicalEntry
canonical form: wintertime
sense: 15262579-n
part of speech: noun

15262579-n
type: LexicalConcept
in scheme: en-word.net
definition: the coldest season of the year; in the Northern Hemisphere it extends from the winter solstice to the vernal equinox
ili: i117312
lexfile: noun.time
part of speech: noun
hypernym: 15261272-n
mero part: 15247986-n
mero part: 15262871-n