whelk-v
type: LexicalEntry
canonical form: whelk
sense: 01145613-v
part of speech: verb

01145613-v
type: LexicalConcept
in scheme: en-word.net
definition: gather whelk
ili: i27332
lexfile: verb.competition
part of speech: verb
hypernym: 01385571-v

whelk-n
type: LexicalEntry
canonical form: whelk
sense: 01950037-n
part of speech: noun
sense: 07798780-n

01950037-n
type: LexicalConcept
in scheme: en-word.net
definition: large carnivorous marine gastropods of coastal waters and intertidal regions having a strong snail-like shell
ili: i45571
lexfile: noun.animal
part of speech: noun
hypernym: 01948486-n
mero substance: 07798780-n

07798780-n
type: LexicalConcept
in scheme: en-word.net
definition: large marine snail much used as food in Europe
ili: i77983
lexfile: noun.food
part of speech: noun
hypernym: 07792842-n