weekend-v
type: LexicalEntry
canonical form: weekend
sense: 02713847-v
part of speech: verb

02713847-v
type: LexicalConcept
in scheme: en-word.net
definition: spend the weekend
ili: i35200
lexfile: verb.stative
part of speech: verb
hypernym: 02714280-v

weekend-n
type: LexicalEntry
canonical form: weekend
sense: 15195551-n
part of speech: noun

15195551-n
type: LexicalConcept
in scheme: en-word.net
definition: a time period usually extending from Friday night through Sunday; more loosely defined as any period of successive days including one and only one Sunday
ili: i116940
lexfile: noun.time
part of speech: noun
hypernym: 15137796-n
mero part: 15188844-n
mero part: 15189617-n