baton-n
type: LexicalEntry
canonical form: baton
sense: 02812499-n
part of speech: noun

wand-n
type: LexicalEntry
canonical form: wand
sense: 02812499-n
part of speech: noun
sense: 04556915-n
sense: 07282278-n
sense: 13185183-n

02812499-n
type: LexicalConcept
in scheme: en-word.net
definition: a thin tapered rod used by a conductor to lead an orchestra or choir
ili: i50570
lexfile: noun.artifact
part of speech: noun
hypernym: 04107268-n

04556915-n
type: LexicalConcept
in scheme: en-word.net
definition: a rod used by a magician or water diviner
ili: i60943
lexfile: noun.artifact
part of speech: noun
hypernym: 04107268-n

scepter-n
type: LexicalEntry
canonical form: scepter
sense: 07282278-n
part of speech: noun

sceptre-n
type: LexicalEntry
canonical form: sceptre
sense: 07282278-n
part of speech: noun

verge-n
type: LexicalEntry
canonical form: verge
sense: 07282278-n
part of speech: noun

07282278-n
type: LexicalConcept
in scheme: en-word.net
definition: a ceremonial or emblematic staff
ili: i74874
lexfile: noun.communication
part of speech: noun
hypernym: 07281865-n

13185183-n
type: LexicalConcept
in scheme: en-word.net
definition: a thin supple twig or rod
example: stems bearing slender wands of flowers
ili: i105846
lexfile: noun.plant
part of speech: noun
hypernym: 13184889-n