vote-n
type: LexicalEntry
canonical form: vote
sense: 05865749-n
part of speech: noun

voter turnout-n
type: LexicalEntry
canonical form: voter turnout
sense: 05865749-n
part of speech: noun

05865749-n
type: LexicalConcept
in scheme: en-word.net
definition: the total number of voters who participated
example: they are expecting a large vote
ili: i67650
lexfile: noun.cognition
part of speech: noun
hypernym: 05864650-n