volatilize-v
type: LexicalEntry
canonical form: volatilize
sense: 00553330-v
part of speech: verb

volatilise-v
type: LexicalEntry
canonical form: volatilise
sense: 00553330-v
part of speech: verb

00553330-v
type: LexicalConcept
in scheme: en-word.net
definition: make volatile; cause to pass off in a vapor
ili: i24504
lexfile: verb.change
part of speech: verb
domain topic: 06094057-n
hypernym: 00126072-v