villa-n
type: LexicalEntry
canonical form: villa
sense: 04542547-n
part of speech: noun
sense: 04542665-n
sense: 04542819-n

04542547-n
type: LexicalConcept
in scheme: en-word.net
definition: pretentious and luxurious country residence with extensive grounds
ili: i60858
lexfile: noun.artifact
part of speech: noun
hypernym: 03123620-n

04542665-n
type: LexicalConcept
in scheme: en-word.net
definition: country house in ancient Rome consisting of residential quarters and farm buildings around a courtyard
ili: i60859
lexfile: noun.artifact
part of speech: noun
hypernym: 03123620-n

04542819-n
type: LexicalConcept
in scheme: en-word.net
definition: detached or semidetached suburban house
ili: i60860
lexfile: noun.artifact
part of speech: noun
domain region: 08879115-n
hypernym: 03549540-n