vein-v
type: LexicalEntry
canonical form: vein
sense: 01700245-v
part of speech: verb

01700245-v
type: LexicalConcept
in scheme: en-word.net
definition: make a veinlike pattern
ili: i30227
lexfile: verb.creation
part of speech: verb
hypernym: 00286768-v

vein-n
type: LexicalEntry
canonical form: vein
sense: 02471366-n
part of speech: noun
sense: 05426061-n
sense: 07103814-n
sense: 09493352-n
sense: 13118945-n

nervure-n
type: LexicalEntry
canonical form: nervure
sense: 02471366-n
part of speech: noun
sense: 13118945-n

02471366-n
type: LexicalConcept
in scheme: en-word.net
definition: one of the horny ribs that stiffen and support the wing of an insect
ili: i48639
lexfile: noun.animal
part of speech: noun
hypernym: 05243209-n

vena-n
type: LexicalEntry
canonical form: vena
sense: 05426061-n
part of speech: noun

venous blood vessel-n
type: LexicalEntry
canonical form: venous blood vessel
sense: 05426061-n
part of speech: noun

05426061-n
type: LexicalConcept
in scheme: en-word.net
definition: a blood vessel that carries blood from the capillaries toward the heart
example: all veins except the pulmonary vein carry unaerated blood
ili: i65437
lexfile: noun.body
part of speech: noun
hypernym: 05425319-n

07103814-n
type: LexicalConcept
in scheme: en-word.net
definition: a distinctive style or manner
example: he continued in this vein for several minutes
ili: i73908
lexfile: noun.communication
part of speech: noun
hypernym: 07080699-n

mineral vein-n
type: LexicalEntry
canonical form: mineral vein
sense: 09493352-n
part of speech: noun

09493352-n
type: LexicalConcept
in scheme: en-word.net
definition: a layer of ore between layers of rock
ili: i86386
lexfile: noun.object
part of speech: noun
hypernym: 09310874-n

13118945-n
type: LexicalConcept
in scheme: en-word.net
definition: any of the vascular bundles or ribs that form the branching framework of conducting and supporting tissues in a leaf or other plant organ
ili: i105546
lexfile: noun.plant
part of speech: noun
hypernym: 13118708-n