vegetarian-n
type: LexicalEntry
canonical form: vegetarian
sense: 10766787-n
part of speech: noun

10766787-n
type: LexicalConcept
in scheme: en-word.net
definition: eater of fruits and grains and nuts; someone who eats no meat or fish or (often) any animal products
ili: i93894
lexfile: noun.person
part of speech: noun
hypernym: 10062108-n

vegetarian-a
type: LexicalEntry
canonical form: vegetarian
sense: https://en-word.net/lemma/vegetarian-a#82572455-a
part of speech: adjective

https://en-word.net/synset/82572455-a
type: LexicalConcept
in scheme: en-word.net
definition: not containing meat
example: AKA every vegetarian thing that Ash has in her fridge that will remotely go well together
  source: UD_English-GUM Corpus
lexfile: adj.all
part of speech: adjective
similar: https://en-word.net/synset/00832318-a