interface-n
type: LexicalEntry
canonical form: interface
sense: 06587403-n
part of speech: noun

user interface-n
type: LexicalEntry
canonical form: user interface
sense: 06587403-n
part of speech: noun

06587403-n
type: LexicalConcept
in scheme: en-word.net
definition: (computer science) a program that controls a display for the user (usually on a computer monitor) and that allows the user to interact with the system
ili: i71007
lexfile: noun.communication
part of speech: noun
domain topic: 06138021-n
hypernym: 06581154-n