unpin-v
type: LexicalEntry
canonical form: unpin
sense: 01371139-v
part of speech: verb

01371139-v
type: LexicalConcept
in scheme: en-word.net
definition: remove the pins from; unfasten the pins of
ili: i28550
lexfile: verb.contact
part of speech: verb
hypernym: 01522610-v