mercilessness-n
type: LexicalEntry
canonical form: mercilessness
sense: 04838262-n
part of speech: noun

unmercifulness-n
type: LexicalEntry
canonical form: unmercifulness
sense: 04838262-n
part of speech: noun

04838262-n
type: LexicalConcept
in scheme: en-word.net
definition: inhumaneness evidenced by an unwillingness to be kind or forgiving
ili: i62381
lexfile: noun.attribute
part of speech: noun
hypernym: 04837333-n