horny structure-n
type: LexicalEntry
canonical form: horny structure
sense: 05589145-n
part of speech: noun

unguis-n
type: LexicalEntry
canonical form: unguis
sense: 05589145-n
part of speech: noun

05589145-n
type: LexicalConcept
in scheme: en-word.net
definition: any rigid body structure composed primarily of keratin
ili: i66245
lexfile: noun.body
part of speech: noun
hypernym: 05232895-n