disbelieving-a
type: LexicalEntry
canonical form: disbelieving
sense: 00650269-s
part of speech: adjective

skeptical-a
type: LexicalEntry
canonical form: skeptical
sense: 00650269-s
part of speech: adjective

sceptical-a
type: LexicalEntry
canonical form: sceptical
sense: 00650269-s
part of speech: adjective

unbelieving-a
type: LexicalEntry
canonical form: unbelieving
sense: 00650269-s
part of speech: adjective
sense: 01309042-s
sense: 01788744-s

00650269-s
type: LexicalConcept
in scheme: en-word.net
definition: denying or questioning the tenets of especially a religion
example: a skeptical approach to the nature of miracles
ili: i3598
lexfile: adj.all
part of speech: adjective satellite
similar: https://en-word.net/synset/00650092-a

nescient-a
type: LexicalEntry
canonical form: nescient
sense: 01309042-s
part of speech: adjective

01309042-s
type: LexicalConcept
in scheme: en-word.net
definition: holding that only material phenomena can be known and knowledge of spiritual matters or ultimate causes is impossible
ili: i7118
lexfile: adj.all
part of speech: adjective satellite
similar: https://en-word.net/synset/01308884-a

atheistic-a
type: LexicalEntry
canonical form: atheistic
sense: 01788744-s
part of speech: adjective

atheistical-a
type: LexicalEntry
canonical form: atheistical
sense: 01788744-s
part of speech: adjective

01788744-s
type: LexicalConcept
in scheme: en-word.net
definition: rejecting any belief in gods
ili: i9789
lexfile: adj.all
part of speech: adjective satellite
similar: https://en-word.net/synset/01788544-a