unagitated-a
type: LexicalEntry
canonical form: unagitated
sense: https://en-word.net/lemma/unagitated-a#00087837-a
part of speech: adjective
sense: https://en-word.net/lemma/unagitated-a#00089343-a
sense: 00531862-s

https://en-word.net/synset/00087837-a
type: LexicalConcept
in scheme: en-word.net
definition: not agitated or disturbed emotionally
ili: i459
lexfile: adj.all
part of speech: adjective
also: https://en-word.net/synset/00531471-a
also: https://en-word.net/synset/02541827-a
also: https://en-word.net/synset/01929162-a
also: https://en-word.net/synset/02416399-a
also: https://en-word.net/synset/02309241-a
also: https://en-word.net/synset/00924122-a

https://en-word.net/synset/00089343-a
type: LexicalConcept
in scheme: en-word.net
definition: not physically disturbed or set in motion
ili: i467
lexfile: adj.all
part of speech: adjective
similar: 00089477-s
similar: 00089584-s

calm-a
type: LexicalEntry
canonical form: calm
sense: 00531862-s
part of speech: adjective

serene-a
type: LexicalEntry
canonical form: serene
sense: 00531862-s
part of speech: adjective

tranquil-a
type: LexicalEntry
canonical form: tranquil
sense: 00531862-s
part of speech: adjective

00531862-s
type: LexicalConcept
in scheme: en-word.net
definition: not agitated; without losing self-possession
example: spoke in a calm voice
example: remained calm throughout the uproar
example: he remained serene in the midst of turbulence
example: a serene expression on her face
example: she became more tranquil
ili: i2969
lexfile: adj.all
part of speech: adjective satellite
similar: https://en-word.net/synset/00531471-a