referee-v
type: LexicalEntry
canonical form: referee
sense: 01087648-v
part of speech: verb

umpire-v
type: LexicalEntry
canonical form: umpire
sense: 01087648-v
part of speech: verb

01087648-v
type: LexicalConcept
in scheme: en-word.net
definition: be a referee or umpire in a sports competition
ili: i27019
lexfile: verb.competition
part of speech: verb
domain topic: 00524569-n
hypernym: 00674196-v

arbiter-n
type: LexicalEntry
canonical form: arbiter
sense: 09822852-n
part of speech: noun

arbitrator-n
type: LexicalEntry
canonical form: arbitrator
sense: 09822852-n
part of speech: noun

umpire-n
type: LexicalEntry
canonical form: umpire
sense: 09822852-n
part of speech: noun
sense: 10755641-n

09822852-n
type: LexicalConcept
in scheme: en-word.net
definition: someone chosen to judge and decide a disputed issue
example: the critic was considered to be an arbiter of modern literature
example: the arbitrator's authority derived from the consent of the disputants
example: an umpire was appointed to settle the tax case
ili: i88272
lexfile: noun.person
part of speech: noun
hypernym: 10086539-n

ump-n
type: LexicalEntry
canonical form: ump
sense: 10755641-n
part of speech: noun

10755641-n
type: LexicalConcept
in scheme: en-word.net
definition: an official at a baseball game
ili: i93824
lexfile: noun.person
part of speech: noun
hypernym: 10391775-n