turtle-v
type: LexicalEntry
canonical form: turtle
sense: 01144789-v
part of speech: verb
sense: 01897306-v

01144789-v
type: LexicalConcept
in scheme: en-word.net
definition: hunt for turtles, especially as an occupation
ili: i27326
lexfile: verb.competition
part of speech: verb
hypernym: 01146304-v

turtle-n
type: LexicalEntry
canonical form: turtle
sense: 01665425-n
part of speech: noun
sense: 04509492-n

01665425-n
type: LexicalConcept
in scheme: en-word.net
definition: any of various aquatic and land reptiles having a bony shell and flipper-like limbs for swimming
ili: i44036
lexfile: noun.animal
part of speech: noun
hypernym: 01665263-n
mero part: 01906397-n
mero part: 01906670-n

capsize-v
type: LexicalEntry
canonical form: capsize
sense: 01897306-v
part of speech: verb

turn turtle-v
type: LexicalEntry
canonical form: turn turtle
sense: 01897306-v
part of speech: verb

01897306-v
type: LexicalConcept
in scheme: en-word.net
definition: overturn accidentally
example: Don't rock the boat or it will capsize!
ili: i31171
lexfile: verb.motion
part of speech: verb
hypernym: 01913390-v

turtleneck-n
type: LexicalEntry
canonical form: turtleneck
sense: 04509492-n
part of speech: noun

polo-neck-n
type: LexicalEntry
canonical form: polo-neck
sense: 04509492-n
part of speech: noun

04509492-n
type: LexicalConcept
in scheme: en-word.net
definition: a sweater or jersey with a high close-fitting collar
ili: i60665
lexfile: noun.artifact
part of speech: noun
hypernym: 04377135-n
hypernym: 03600807-n
mero part: 04509659-n