tuneful-a
type: LexicalEntry
canonical form: tuneful
sense: https://en-word.net/lemma/tuneful-a#01505874-a
part of speech: adjective

melodious-a
type: LexicalEntry
canonical form: melodious
sense: https://en-word.net/lemma/melodious-a#01505874-a
part of speech: adjective

https://en-word.net/synset/01505874-a
type: LexicalConcept
in scheme: en-word.net
definition: having a musical sound; especially a pleasing tune
ili: i8243
lexfile: adj.all
part of speech: adjective