clear-cut-a
type: LexicalEntry
canonical form: clear-cut
sense: 00430512-s
part of speech: adjective

distinct-a
type: LexicalEntry
canonical form: distinct
sense: 00430512-s
part of speech: adjective

trenchant-a
type: LexicalEntry
canonical form: trenchant
sense: 00430512-s
part of speech: adjective
sense: 00838498-s
sense: 01339324-s

00430512-s
type: LexicalConcept
in scheme: en-word.net
definition: clearly or sharply defined to the mind
example: clear-cut evidence of tampering
example: Claudius was the first to invade Britain with distinct … intentions of conquest
example: trenchant distinctions between right and wrong
ili: i2427
lexfile: adj.all
part of speech: adjective satellite
similar: https://en-word.net/synset/00429900-a

hard-hitting-a
type: LexicalEntry
canonical form: hard-hitting
sense: 00838498-s
part of speech: adjective

00838498-s
type: LexicalConcept
in scheme: en-word.net
definition: characterized by or full of force and vigor
example: a hard-hitting expose
example: a trenchant argument
ili: i4585
lexfile: adj.all
part of speech: adjective satellite
similar: https://en-word.net/synset/00837737-a

searching-a
type: LexicalEntry
canonical form: searching
sense: 01339324-s
part of speech: adjective

01339324-s
type: LexicalConcept
in scheme: en-word.net
definition: having keenness and forcefulness and penetration in thought, expression, or intellect
example: searching insights
example: trenchant criticism
ili: i7287
lexfile: adj.all
part of speech: adjective satellite
similar: https://en-word.net/synset/01337350-a