trek-n
type: LexicalEntry
canonical form: trek
sense: 00311173-n
part of speech: noun
sense: 00311342-n

00311173-n
type: LexicalConcept
in scheme: en-word.net
definition: any long and difficult trip
ili: i37038
lexfile: noun.act
part of speech: noun
hypernym: 00309196-n

00311342-n
type: LexicalConcept
in scheme: en-word.net
definition: a journey by ox wagon (especially an organized migration by a group of settlers)
ili: i37040
lexfile: noun.act
part of speech: noun
domain region: 09021852-n
hypernym: 00307252-n

trek-v
type: LexicalEntry
canonical form: trek
sense: 01851162-v
part of speech: verb
sense: 01851334-v

01851162-v
type: LexicalConcept
in scheme: en-word.net
definition: make a long and difficult journey
example: They trekked towards the North Pole with sleds and skis
ili: i30945
lexfile: verb.motion
part of speech: verb
hypernym: 01849662-v

01851334-v
type: LexicalConcept
in scheme: en-word.net
definition: journey on foot, especially in the mountains
example: We spent the summer trekking in the foothills of the Himalayas
ili: i30946
lexfile: verb.motion
part of speech: verb
hypernym: 01849662-v