trait-n
type: LexicalEntry
canonical form: trait
sense: 04623416-n
part of speech: noun

04623416-n
type: LexicalConcept
in scheme: en-word.net
definition: a distinguishing feature of your personal nature
ili: i61343
lexfile: noun.attribute
part of speech: noun
hypernym: 00024444-n