dealings-n
type: LexicalEntry
canonical form: dealings
sense: 00041542-n
part of speech: noun

traffic-n
type: LexicalEntry
canonical form: traffic
sense: 00041542-n
part of speech: noun
sense: 01115977-n
sense: 07294158-n
sense: 08442260-n

00041542-n
type: LexicalConcept
in scheme: en-word.net
definition: social or verbal interchange (usually followed by ‘with’)
ili: i35625
lexfile: noun.act
part of speech: noun
hypernym: 00040890-n

01115977-n
type: LexicalConcept
in scheme: en-word.net
definition: buying and selling; especially illicit trade
ili: i41235
lexfile: noun.act
part of speech: noun
hypernym: 01092370-n

traffic-v
type: LexicalEntry
canonical form: traffic
sense: 02265577-v
part of speech: verb
sense: 02265930-v

02265577-v
type: LexicalConcept
in scheme: en-word.net
definition: trade or deal a commodity
example: They trafficked with us for gold
ili: i33036
lexfile: verb.possession
part of speech: verb
domain topic: 01092370-n
hypernym: 02265169-v

02265930-v
type: LexicalConcept
in scheme: en-word.net
definition: deal illegally
example: traffic drugs
ili: i33038
lexfile: verb.possession
part of speech: verb
domain topic: 00767761-n
hypernym: 02265169-v

07294158-n
type: LexicalConcept
in scheme: en-word.net
definition: the amount of activity over a communication system during a given period of time
example: heavy traffic overloaded the trunk lines
example: traffic on the internet is lightest during the night
ili: i74945
lexfile: noun.communication
part of speech: noun
hypernym: 06262268-n

08442260-n
type: LexicalConcept
in scheme: en-word.net
definition: the aggregation of things (pedestrians or vehicles) coming and going in a particular locality during a specified period of time
ili: i81388
lexfile: noun.group
part of speech: noun
hypernym: 07968050-n