tongs-n
type: LexicalEntry
canonical form: tongs
sense: 04458020-n
part of speech: noun

pair of tongs-n
type: LexicalEntry
canonical form: pair of tongs
sense: 04458020-n
part of speech: noun

04458020-n
type: LexicalConcept
in scheme: en-word.net
definition: any of various devices for taking hold of objects; usually have two hinged legs with handles above and pointed hooks below
ili: i60359
lexfile: noun.artifact
part of speech: noun
exemplifies: 06306016-n
hypernym: 03187746-n