till-v
type: LexicalEntry
canonical form: till
sense: 01744489-v
part of speech: verb

01744489-v
type: LexicalConcept
in scheme: en-word.net
definition: work land as by ploughing, harrowing, and manuring, in order to make it ready for cultivation
example: till the soil
ili: i30439
lexfile: verb.creation
part of speech: verb
domain topic: 00918295-n
entails: 01745327-v
hypernym: 01672498-v

cashbox-n
type: LexicalEntry
canonical form: cashbox
sense: 02980398-n
part of speech: noun

money box-n
type: LexicalEntry
canonical form: money box
sense: 02980398-n
part of speech: noun

till-n
type: LexicalEntry
canonical form: till
sense: 02980398-n
part of speech: noun
sense: 13379064-n
sense: 15099339-n

02980398-n
type: LexicalConcept
in scheme: en-word.net
definition: a strongbox for holding cash
ili: i51602
lexfile: noun.artifact
part of speech: noun
hypernym: 04347828-n

public treasury-n
type: LexicalEntry
canonical form: public treasury
sense: 13379064-n
part of speech: noun

trough-n
type: LexicalEntry
canonical form: trough
sense: 13379064-n
part of speech: noun

13379064-n
type: LexicalConcept
in scheme: en-word.net
definition: a treasury for government funds
ili: i106903
lexfile: noun.possession
part of speech: noun
hypernym: 13378158-n

boulder clay-n
type: LexicalEntry
canonical form: boulder clay
sense: 15099339-n
part of speech: noun

15099339-n
type: LexicalConcept
in scheme: en-word.net
definition: unstratified soil deposited by a glacier; consists of sand and clay and gravel and boulders mixed together
ili: i116406
lexfile: noun.substance
part of speech: noun
hypernym: 14868863-n