therapist-n
type: LexicalEntry
canonical form: therapist
sense: 10726882-n
part of speech: noun

healer-n
type: LexicalEntry
canonical form: healer
sense: 10726882-n
part of speech: noun

10726882-n
type: LexicalConcept
in scheme: en-word.net
definition: a person skilled in a particular type of therapy
ili: i93627
lexfile: noun.person
part of speech: noun
hypernym: 09640897-n