thatch-n
type: LexicalEntry
canonical form: thatch
sense: 04424807-n
part of speech: noun

thatched roof-n
type: LexicalEntry
canonical form: thatched roof
sense: 04424807-n
part of speech: noun

04424807-n
type: LexicalConcept
in scheme: en-word.net
definition: a house roof made with a plant material (as straw)
ili: i60162
lexfile: noun.artifact
part of speech: noun
hypernym: 04112162-n