thatch-v
type: LexicalEntry
canonical form: thatch
sense: 01236402-v
part of speech: verb

01236402-v
type: LexicalConcept
in scheme: en-word.net
definition: cover with thatch
example: thatch the roofs
ili: i27793
lexfile: verb.contact
part of speech: verb
hypernym: 01236557-v

thatch-n
type: LexicalEntry
canonical form: thatch
sense: 04424807-n
part of speech: noun
sense: 05268809-n
sense: 15094279-n

thatched roof-n
type: LexicalEntry
canonical form: thatched roof
sense: 04424807-n
part of speech: noun

04424807-n
type: LexicalConcept
in scheme: en-word.net
definition: a house roof made with a plant material (as straw)
ili: i60162
lexfile: noun.artifact
part of speech: noun
hypernym: 04112162-n

05268809-n
type: LexicalConcept
in scheme: en-word.net
definition: hair resembling thatched roofing material
ili: i64609
lexfile: noun.body
part of speech: noun
hypernym: 05264345-n

15094279-n
type: LexicalConcept
in scheme: en-word.net
definition: plant stalks used as roofing material
ili: i116376
lexfile: noun.substance
part of speech: noun
hypernym: 15030283-n