thank-v
type: LexicalEntry
canonical form: thank
sense: 00893836-v
part of speech: verb

give thanks-v
type: LexicalEntry
canonical form: give thanks
sense: 00893836-v
part of speech: verb

00893836-v
type: LexicalConcept
in scheme: en-word.net
definition: express gratitude or show appreciation to
ili: i26079
lexfile: verb.communication
part of speech: verb
hypernym: 00930591-v