tentorium-n
type: LexicalEntry
canonical form: tentorium
sense: 05615157-n
part of speech: noun

05615157-n
type: LexicalConcept
in scheme: en-word.net
definition: (anatomy) a fold of dura mater that covers the cerebellum and supports the occipital lobes of the cerebrum
ili: i66378
lexfile: noun.body
part of speech: noun
domain topic: 06067070-n
hypernym: 05499911-n
mero substance: 05490181-n