tattoo-n
type: LexicalEntry
canonical form: tattoo
sense: 00264196-n
part of speech: noun
sense: 04402786-n
sense: 06818355-n

00264196-n
type: LexicalConcept
in scheme: en-word.net
definition: the practice of making a design on the skin by pricking and staining
ili: i36779
lexfile: noun.act
part of speech: noun
hypernym: 00263092-n

tattoo-v
type: LexicalEntry
canonical form: tattoo
sense: 01685228-v
part of speech: verb

01685228-v
type: LexicalConcept
in scheme: en-word.net
definition: stain (skin) with indelible color
ili: i30152
lexfile: verb.creation
part of speech: verb
entails: 01443420-v
hypernym: 00286768-v

04402786-n
type: LexicalConcept
in scheme: en-word.net
definition: a design on the skin made by tattooing
ili: i60026
lexfile: noun.artifact
part of speech: noun
hypernym: 03183448-n

06818355-n
type: LexicalConcept
in scheme: en-word.net
definition: a drumbeat or bugle call that signals the military to return to their quarters
ili: i72255
lexfile: noun.communication
part of speech: noun
domain topic: 08215965-n
hypernym: 06817986-n
hypernym: 06817057-n