tarmacadam-n
type: LexicalEntry
canonical form: tarmacadam
sense: 04401723-n
part of speech: noun
sense: 15001747-n

tarmac-n
type: LexicalEntry
canonical form: tarmac
sense: 04401723-n
part of speech: noun
sense: 15001747-n

macadam-n
type: LexicalEntry
canonical form: macadam
sense: 04401723-n
part of speech: noun

04401723-n
type: LexicalConcept
in scheme: en-word.net
definition: a paved surface having compressed layers of broken rocks held together with tar
ili: i60019
lexfile: noun.artifact
part of speech: noun
hypernym: 03906587-n

15001747-n
type: LexicalConcept
in scheme: en-word.net
definition: a paving material of tar and broken stone; mixed in a factory and shaped during paving
ili: i115847
lexfile: noun.substance
part of speech: noun
hypernym: 15002063-n