talc-v
type: LexicalEntry
canonical form: talc
sense: 00042095-v
part of speech: verb

00042095-v
type: LexicalConcept
in scheme: en-word.net
definition: apply talcum powder to (one's body)
ili: i21980
lexfile: verb.body
part of speech: verb
hypernym: 00041904-v

talc-n
type: LexicalEntry
canonical form: talc
sense: 15090934-n
part of speech: noun

talcum-n
type: LexicalEntry
canonical form: talcum
sense: 15090934-n
part of speech: noun

15090934-n
type: LexicalConcept
in scheme: en-word.net
definition: a fine grained mineral having a soft soapy feel and consisting of hydrated magnesium silicate; used in a variety of products including talcum powder
ili: i116355
lexfile: noun.substance
part of speech: noun
hypernym: 14686753-n