symbolism-n
type: LexicalEntry
canonical form: symbolism
sense: 00413284-n
part of speech: noun
sense: 06820707-n
sense: 08487518-n

symbolization-n
type: LexicalEntry
canonical form: symbolization
sense: 00413284-n
part of speech: noun

symbolisation-n
type: LexicalEntry
canonical form: symbolisation
sense: 00413284-n
part of speech: noun

00413284-n
type: LexicalConcept
in scheme: en-word.net
definition: the practice of investing things with symbolic meaning
ili: i37566
lexfile: noun.act
part of speech: noun
hypernym: 00411260-n

06820707-n
type: LexicalConcept
in scheme: en-word.net
definition: a system of symbols and symbolic representations
ili: i72266
lexfile: noun.communication
part of speech: noun
hypernym: 06819327-n

08487518-n
type: LexicalConcept
in scheme: en-word.net
definition: an artistic movement in the late 19th century that tried to express abstract or mystical ideas through the symbolic use of images
ili: i81564
lexfile: noun.group
part of speech: noun
hypernym: 08483654-n