symbol-n
type: LexicalEntry
canonical form: symbol
sense: 05773412-n
part of speech: noun
sense: 06819327-n

symbolization-n
type: LexicalEntry
canonical form: symbolization
sense: 05773412-n
part of speech: noun

symbolisation-n
type: LexicalEntry
canonical form: symbolisation
sense: 05773412-n
part of speech: noun

symbolic representation-n
type: LexicalEntry
canonical form: symbolic representation
sense: 05773412-n
part of speech: noun

05773412-n
type: LexicalConcept
in scheme: en-word.net
definition: something visible that by association or convention represents something else that is invisible
example: the eagle is a symbol of the United States
ili: i67194
lexfile: noun.cognition
part of speech: noun
hypernym: 05773156-n

06819327-n
type: LexicalConcept
in scheme: en-word.net
definition: an arbitrary sign (written or printed) that has acquired a conventional significance
ili: i72261
lexfile: noun.communication
part of speech: noun
hypernym: 06804229-n