summer-v
type: LexicalEntry
canonical form: summer
sense: 02715648-v
part of speech: verb

02715648-v
type: LexicalConcept
in scheme: en-word.net
definition: spend the summer
example: We summered in Kashmir
ili: i35210
lexfile: verb.stative
part of speech: verb
hypernym: 02714280-v

summer-n
type: LexicalEntry
canonical form: summer
sense: 15169972-n
part of speech: noun
sense: 15262047-n

15169972-n
type: LexicalConcept
in scheme: en-word.net
definition: the period of finest development, happiness, or beauty
example: the golden summer of his life
ili: i116790
lexfile: noun.time
part of speech: noun
exemplifies: 07120141-n
hypernym: 15169331-n

summertime-n
type: LexicalEntry
canonical form: summertime
sense: 15262047-n
part of speech: noun

15262047-n
type: LexicalConcept
in scheme: en-word.net
definition: the warmest season of the year; in the Northern Hemisphere it extends from the summer solstice to the autumnal equinox
example: they spent a lazy summer at the shore
ili: i117310
lexfile: noun.time
part of speech: noun
hypernym: 15261272-n
mero part: 15246808-n
mero part: 15262364-n