suite-n
type: LexicalEntry
canonical form: suite
sense: 04358628-n
part of speech: noun
sense: 07061069-n
sense: 08023976-n
sense: 08446124-n

rooms-n
type: LexicalEntry
canonical form: rooms
sense: 04358628-n
part of speech: noun

04358628-n
type: LexicalConcept
in scheme: en-word.net
definition: apartment consisting of a series of connected rooms used as a living unit (as in a hotel)
ili: i59762
lexfile: noun.artifact
part of speech: noun
hypernym: 02729230-n

07061069-n
type: LexicalConcept
in scheme: en-word.net
definition: a musical composition of several movements only loosely connected
ili: i73700
lexfile: noun.communication
part of speech: noun
domain topic: 07034009-n
hypernym: 07051211-n

08023976-n
type: LexicalConcept
in scheme: en-word.net
definition: a matching set of furniture
ili: i79377
lexfile: noun.group
part of speech: noun
hypernym: 08013131-n

cortege-n
type: LexicalEntry
canonical form: cortege
sense: 08446124-n
part of speech: noun

retinue-n
type: LexicalEntry
canonical form: retinue
sense: 08446124-n
part of speech: noun

entourage-n
type: LexicalEntry
canonical form: entourage
sense: 08446124-n
part of speech: noun

08446124-n
type: LexicalConcept
in scheme: en-word.net
definition: the group following and attending to some important person
ili: i81413
lexfile: noun.group
part of speech: noun
hypernym: 07991473-n
mero part: 08232722-n