suffragette-n
type: LexicalEntry
canonical form: suffragette
sense: 10692101-n
part of speech: noun

10692101-n
type: LexicalConcept
in scheme: en-word.net
definition: a woman advocate of women's right to vote (especially a militant advocate in the United Kingdom at the beginning of the 20th century)
ili: i93422
lexfile: noun.person
part of speech: noun
domain region: 08879115-n
hypernym: 10692347-n
hypernym: 10104404-n