suborn-v
type: LexicalEntry
canonical form: suborn
sense: 00836622-v
part of speech: verb
sense: 00836837-v
sense: 02587361-v

00836622-v
type: LexicalConcept
in scheme: en-word.net
definition: induce to commit perjury or give false testimony
example: The President tried to suborn false witnesses
ili: i25824
lexfile: verb.communication
part of speech: verb
causes: 00836424-v
hypernym: 00772482-v
similar: 00836837-v

00836837-v
type: LexicalConcept
in scheme: en-word.net
definition: procure (false testimony or perjury)
ili: i25825
lexfile: verb.communication
part of speech: verb
hypernym: 02243552-v
similar: 00836622-v

02587361-v
type: LexicalConcept
in scheme: en-word.net
definition: incite to commit a crime or an evil deed
example: He suborned his butler to cover up the murder of his wife
ili: i34589
lexfile: verb.social
part of speech: verb
hypernym: 02585532-v